Show Posts

This section allows you to view all posts made by this member. Note that you can only see posts made in areas you currently have access to.


Messages - freezway

Pages: « 1 2 3 4 5 6 7 8 9 10 11 12 13 14 15 »
106
Proposals / Re: Tiering vs Components
« on: May 11, 2010, 09:11:51 PM »
frankly, i dont care for backwards compatibility... I just want to be able to make games on my linux comp.... my windows comp is a) uber-sucky or b) uber sucky AND 10 years old (hooray for PIII and RAMBUS)

107
General ENIGMA / Re: ENIGMA's value
« on: May 11, 2010, 05:28:37 PM »
?

108
Proposals / Re: New Rule:
« on: May 09, 2010, 11:59:18 AM »
technique debates should be allowed. language should not.

109
Off-Topic / Re: ACTA
« on: May 08, 2010, 08:33:32 PM »

110
Issues Help Desk / #define?
« on: May 05, 2010, 07:51:15 PM »
how can i use #define in enigma... shortening lengthdir_x to ldx would be handy.

111
Proposals / Re: On Settings and Dependencies
« on: May 05, 2010, 05:25:52 PM »
score_under: +1

112
Announcements / Re: Finals
« on: May 05, 2010, 05:23:49 PM »
good luck. dont die.

113
Announcements / Re: Finals
« on: May 04, 2010, 08:51:12 PM »
OH MY GOD! THEY KILLED HIM! THE BASTARDS!

114
Announcements / Re: Finals
« on: May 04, 2010, 05:30:07 PM »
r204 fixed it for me too... WOOT

115
Announcements / Re: WHAT IS THIS I DON'T EVEN
« on: May 02, 2010, 09:52:41 PM »
Code: [Select]
Makefile:51: target `link-standalone' given more than once in the same rule.
g++ -Wall -g  -fPIC -c cfile_parse/cfile_parse.cpp -o cfile_parse/cfile_parse.o
g++ -Wall -g  -fPIC -c cfile_parse/cfile_parse_macros.cpp -o cfile_parse/cfile_parse_macros.o
g++ -Wall -g  -fPIC -c cfile_parse/cfile_pushing.cpp -o cfile_parse/cfile_pushing.o
g++ -Wall -g  -fPIC -c cfile_parse/cparse_components.cpp -o cfile_parse/cparse_components.o
g++ -Wall -g  -fPIC -c cfile_parse/cparse_shared.cpp -o cfile_parse/cparse_shared.o
g++ -Wall -g  -fPIC -c cfile_parse/expression_evaluator.cpp -o cfile_parse/expression_evaluator.o
g++ -Wall -g  -fPIC -c cfile_parse/handle_letters.cpp -o cfile_parse/handle_letters.o
g++ -Wall -g  -fPIC -c cfile_parse/keyword_operator.cpp -o cfile_parse/keyword_operator.o
g++ -Wall -g  -fPIC -c cfile_parse/macro_functions.cpp -o cfile_parse/macro_functions.o
g++ -Wall -g  -fPIC -c cfile_parse/main.cpp -o cfile_parse/main.o
g++ -Wall -g  -fPIC -c cfile_parse/skipping.cpp -o cfile_parse/skipping.o
g++ -Wall -g  -fPIC -c cfile_parse/template_handlers.cpp -o cfile_parse/template_handlers.o
g++ -Wall -g  -fPIC -c compiler/compile.cpp -o compiler/compile.o
compiler/compile.cpp:53:34: error: compile_organization.h: No such file or directory
compiler/compile.cpp: In function ‘int compileEGMf(EnigmaStruct*, const char*, int)’:
compiler/compile.cpp:168: error: ‘parsed_script’ was not declared in this scope
compiler/compile.cpp:168: error: ‘scripts’ was not declared in this scope
compiler/compile.cpp:169: error: ‘parsed_script’ cannot appear in a constant-expression
compiler/compile.cpp:169: error: template argument 2 is invalid
compiler/compile.cpp:169: error: template argument 4 is invalid
compiler/compile.cpp:169: error: invalid type in declaration before ‘;’ token
compiler/compile.cpp:177: error: ‘E_ERROR_SYNTAX’ was not declared in this scope
compiler/compile.cpp:179: error: expected type-specifier before ‘parsed_script’
compiler/compile.cpp:179: error: expected ‘;’ before ‘parsed_script’
compiler/compile.cpp:196: error: ‘curscript’ was not declared in this scope
compiler/compile.cpp:199: error: ‘parsed_script’ cannot appear in a constant-expression
compiler/compile.cpp:199: error: template argument 2 is invalid
compiler/compile.cpp:199: error: template argument 4 is invalid
compiler/compile.cpp:199: error: expected initializer before ‘subscr’
compiler/compile.cpp:200: error: ‘subscr’ was not declared in this scope
compiler/compile.cpp:200: error: request for member ‘end’ in ‘scr_lookup’, which is of non-class type ‘int’
compiler/compile.cpp:211: error: ‘curscript’ was not declared in this scope
compiler/compile.cpp:216: error: ‘parsed_script’ cannot appear in a constant-expression
compiler/compile.cpp:216: error: template argument 2 is invalid
compiler/compile.cpp:216: error: template argument 4 is invalid
compiler/compile.cpp:216: error: expected initializer before ‘subscr’
compiler/compile.cpp:217: error: ‘subscr’ was not declared in this scope
compiler/compile.cpp:217: error: request for member ‘end’ in ‘scr_lookup’, which is of non-class type ‘int’
compiler/compile.cpp:262: error: ‘E_ERROR_SYNTAX’ was not declared in this scope
compiler/compile.cpp:289: error: ‘parsed_script’ cannot appear in a constant-expression
compiler/compile.cpp:289: error: template argument 2 is invalid
compiler/compile.cpp:289: error: template argument 4 is invalid
compiler/compile.cpp:289: error: expected initializer before ‘subscr’
compiler/compile.cpp:290: error: ‘subscr’ was not declared in this scope
compiler/compile.cpp:290: error: request for member ‘end’ in ‘scr_lookup’, which is of non-class type ‘int’
compiler/compile.cpp:295: error: ‘parsed_script’ cannot appear in a constant-expression
compiler/compile.cpp:295: error: template argument 2 is invalid
compiler/compile.cpp:295: error: template argument 4 is invalid
compiler/compile.cpp:295: error: expected initializer before ‘subscr’
compiler/compile.cpp:296: error: ‘subscr’ was not declared in this scope
compiler/compile.cpp:296: error: request for member ‘end’ in ‘scr_lookup’, which is of non-class type ‘int’
compiler/compile.cpp:416: error: ‘parsed_script’ cannot appear in a constant-expression
compiler/compile.cpp:416: error: template argument 2 is invalid
compiler/compile.cpp:416: error: template argument 4 is invalid
compiler/compile.cpp:416: error: expected initializer before ‘subscr’
compiler/compile.cpp:417: error: ‘subscr’ was not declared in this scope
compiler/compile.cpp:417: error: request for member ‘end’ in ‘scr_lookup’, which is of non-class type ‘int’
compiler/compile.cpp:475: error: ‘parsed_script’ cannot appear in a constant-expression
compiler/compile.cpp:475: error: template argument 2 is invalid
compiler/compile.cpp:475: error: template argument 4 is invalid
compiler/compile.cpp:475: error: expected initializer before ‘subscr’
compiler/compile.cpp:476: error: ‘subscr’ was not declared in this scope
compiler/compile.cpp:476: error: request for member ‘end’ in ‘scr_lookup’, which is of non-class type ‘int’
compiler/compile.cpp:589: error: ‘E_ERROR_SYNTAX’ was not declared in this scope
compiler/compile.cpp:623: error: ‘E_ERROR_BUILD’ was not declared in this scope
make: *** [objects] Error 1

rev. 202

116
Issues Help Desk / Re: STUPID IRC
« on: April 27, 2010, 06:51:37 PM »
now then... see we helped the forum... there is now at least 1 more topic!

117
whenever i use window_set_caption() it  doesn't throw errors.... or do anything....

118
Announcements / Re: Things that are broke
« on: April 19, 2010, 07:35:31 PM »
?
wHAT?

119
Announcements / Re: Things that are broke
« on: April 18, 2010, 10:32:09 PM »
also, when i compile the game i get a lot of warnings about pragma or something...

120
k

Pages: « 1 2 3 4 5 6 7 8 9 10 11 12 13 14 15 »