Pages: [1]
  Print  
Author Topic: Error  (Read 1194 times)
Offline (Male) retep998
Posted on: May 24, 2010, 03:01:21 PM

Member
Location: Where else?
Joined: Jan 2010
Posts: 248
MSN Messenger - retep998@charter.net AOL Instant Messenger - retep998 Yahoo Instant Messenger - retep998
View Profile Email
http://pastebin.com/xj7rH56R
Code: [Select]
C:\Users\Owner\Documents\Coding\Enigma\trunk>java -jar lgm16b4.jar
Java Version: 10600 (1.6.0_20)
Loading lib files in C:\Users\Owner\Documents\Coding\Enigma\trunk\lgm16b4.jar
01_move.lgl 02_main1.lgl 03_main2.lgl 04_control.lgl
 05_score.lgl 06_extra.lgl 07_draw.lgl
SvnKit missing, corrupted, or unusable. Please download and place next to the en
igma plugin in order to enable auto-update.
Initializing Enigma: Exception in thread "main" java.lang.UnsatisfiedLinkError:
Unable to load library 'compileEGMf': The specified module could not be found.

        at com.sun.jna.NativeLibrary.loadLibrary(NativeLibrary.java:164)
        at com.sun.jna.NativeLibrary.getInstance(NativeLibrary.java:237)
        at com.sun.jna.NativeLibrary.getInstance(NativeLibrary.java:200)
        at com.sun.jna.Native.register(Native.java:1013)
        at org.enigma.backend.EnigmaDriver.<clinit>(EnigmaDriver.java:14)
        at org.enigma.EnigmaRunner.initEnigmaLib(EnigmaRunner.java:119)
        at org.enigma.EnigmaRunner.<init>(EnigmaRunner.java:96)
        at sun.reflect.NativeConstructorAccessorImpl.newInstance0(Native Method)

        at sun.reflect.NativeConstructorAccessorImpl.newInstance(Unknown Source)

        at sun.reflect.DelegatingConstructorAccessorImpl.newInstance(Unknown Sou
rce)
        at java.lang.reflect.Constructor.newInstance(Unknown Source)
        at java.lang.Class.newInstance0(Unknown Source)
        at java.lang.Class.newInstance(Unknown Source)
        at org.lateralgm.main.LGM.loadPlugins(LGM.java:297)
        at org.lateralgm.main.LGM.main(LGM.java:512)
I updated to the latest revision and compiled the dll.
And I got this error.
Fix please.
Logged
Offline (Male) retep998
Reply #1 Posted on: May 27, 2010, 01:34:51 PM

Member
Location: Where else?
Joined: Jan 2010
Posts: 248
MSN Messenger - retep998@charter.net AOL Instant Messenger - retep998 Yahoo Instant Messenger - retep998
View Profile Email
This error has been singled out as a problem of java.
I'm using windows 64-bit with java 6 20.
It started when I installed the jdk, and even after i uninstalled the jdk, the error persists.
DOES ANYONE KNOW WHY THIS FUCKING ERROR OCCURS?
 :froggonk:
Logged
Offline (Female) IsmAvatar
Reply #2 Posted on: May 27, 2010, 01:38:19 PM

LateralGM Developer
LGM Developer
Location: Pennsylvania/USA
Joined: Apr 2008
Posts: 891

View Profile Email
I wonder if it has something to do with 64 bit.
When I tested on Windows, I was using 32 bit.
Logged
Offline (Male) retep998
Reply #3 Posted on: May 27, 2010, 03:45:00 PM

Member
Location: Where else?
Joined: Jan 2010
Posts: 248
MSN Messenger - retep998@charter.net AOL Instant Messenger - retep998 Yahoo Instant Messenger - retep998
View Profile Email
Everyone who has windows (especially windows 7 64-bit) get the jdk and see if this error occurs to you.
Logged
Offline (Male) Josh @ Dreamland
Reply #4 Posted on: May 27, 2010, 06:50:43 PM

Prince of all Goldfish
Developer
Location: Ohio, United States
Joined: Feb 2008
Posts: 2953

View Profile Email
I already said it didn't.
Logged
"That is the single most cryptic piece of code I have ever seen." -Master PobbleWobble
"I disapprove of what you say, but I will defend to the death your right to say it." -Evelyn Beatrice Hall, Friends of Voltaire
Offline (Male) retep998
Reply #5 Posted on: May 27, 2010, 07:59:48 PM

Member
Location: Where else?
Joined: Jan 2010
Posts: 248
MSN Messenger - retep998@charter.net AOL Instant Messenger - retep998 Yahoo Instant Messenger - retep998
View Profile Email
did you try on windows 7 64-bit?
Logged
Offline (Male) MahFreenAmeh
Reply #6 Posted on: June 09, 2010, 06:01:06 PM

sysadmin
"Web Team"
Location: Austin, TX
Joined: Apr 2008
Posts: 15
AOL Instant Messenger - sirmxe
View Profile WWW Email
blame canada.
Logged
sys(tem)admin(istrator)
[java,c++,c,javascript,html,css,php,perl,ruby,python,sql]
if you've got ideas, let me hear them.
Offline (Unknown gender) freezway
Reply #7 Posted on: June 09, 2010, 06:12:31 PM

Member
Joined: Dec 2009
Posts: 220

View Profile
Code: [Select]
C:\Users\Andrew\Desktop\New Folder\trunk>java -jar lgm16b4.jar
Java Version: 10600 (1.6.0_20)
Loading lib files in C:\Users\Andrew\Desktop\New Folder\trunk\lgm16b4.jar
01_move.lgl 02_main1.lgl 03_main2.lgl 04_control.lgl
 05_score.lgl 06_extra.lgl 07_draw.lgl
SvnKit missing, corrupted, or unusable. Please download and place next to the en
igma plugin in order to enable auto-update.
Initializing Enigma: Intializing Parsers.Probing for GCC...
'cpp' is not recognized as an internal or external command,
operable program or batch file.
GCC located. Path: `/MinGW/bin/'
Successfully loaded GCC definitions
Undefining _GLIBCXX_EXPORT_TEMPLATE
# 1 "blank.txt"
# 1 "<built-in>"
# 1 "<command line>"
# 1 "blank.txt"
12dirs:
"/MinGW/bin/../lib/gcc/mingw32/3.4.5/../../../../include/c++/3.4.5/"
"/MinGW/bin/../lib/gcc/mingw32/3.4.5/../../../../include/c++/3.4.5/mingw32/"
"/MinGW/bin/../lib/gcc/mingw32/3.4.5/../../../../include/c++/3.4.5/backward/"
"/MinGW/bin/../lib/gcc/mingw32/3.4.5/../../../../include/"
"/MinGW/bin/../lib/gcc/mingw32/3.4.5/include/"
"/mingw/lib/gcc/mingw32/3.4.5/../../../../include/c++/3.4.5/"
"/mingw/lib/gcc/mingw32/3.4.5/../../../../include/c++/3.4.5/mingw32/"
"/mingw/lib/gcc/mingw32/3.4.5/../../../../include/c++/3.4.5/backward/"
"/mingw/lib/gcc/mingw32/3.4.5/../../../../include/"
"/mingw/include/"
"/mingw/lib/gcc/mingw32/3.4.5/include/"
"/mingw/include/"
All that worked. Trying to find make.
'/MinGW/bin/make' is not recognized as an internal or external command,
operable program or batch file.
GNU Make 3.81
Copyright (C) 2006  Free Software Foundation, Inc.
This is free software; see the source for copying conditions.
There is NO warranty; not even for MERCHANTABILITY or FITNESS FOR A
PARTICULAR PURPOSE.

This program built for i686-pc-mingw32
Good news; it should seem I can reach make from `"/MinGW/bin/mingw32-make"'
Clearing IDE editables... Done.
Opening ENIGMA for parse...
Successfully parsed ENIGMA's engine (324ms)
++++++++++++++++++++++++++++++++++++++++++++++++++++++++++++++++++
Initializing EDL Parser... Done.
Unable to load plugin: jna.jar: null: Missing plugin entry point (LGM-Plugin)
Finding parent...found >> Checking ancestor object_collisions
 >> Checking ancestor object_transform
 >> Checking ancestor object_graphics
 >> Checking ancestor object_planar
 >> Checking ancestor object_basic
Location in memory of structure: 0x52d2020
File version: 600

COPYING SOME FUCKING RESOURCES:
Copying sprite names [1]
Copying sound names [0]
Copying background names [0]
Copying path names [kidding, these are totally not implemented :P] [0]
Copying script names [0]
Copying font names [kidding, these are totally not implemented :P] [0]
Copying timeline names [kidding, these are totally not implemented :P] [0]
Copying object names [1]
Copying room names [1]
SYNTAX CHECKING AND PRIMARY PARSING:
0 Scripts:
"Linking" scripts
`Linking' 0 scripts in 0 passes...
Completing script "Link"
Done.
1 Objects:
 obj_0: 12 events:
"Linking" scripts into the objects...
"Link" complete.



Second pass...done. adding semicolons...
This is what I have to work with:


done. Running make from `"/MinGW/bin/mingw32-make"'
Full command line: "/MinGW/bin/mingw32-make" Game GMODE=Run GFLAGS="" GLINKS="-l
opengl32 '../additional/zlib/libzlib.a' -lcomdlg32 -lgdi32" GRAPHICS=OpenGL PLAT
FORM=windows
echo Okay.
Okay.
cd ENIGMAsystem/SHELL/ && C:/MinGW/bin/mingw32-make GMODE=Run GLINKS="-lopengl32
 '../additional/zlib/libzlib.a' -lcomdlg32 -lgdi32" GRAPHICS=OpenGL PLATFORM=win
dows
mingw32-make[1]: Entering directory `C:/Users/Andrew/Desktop/New Folder/trunk/EN
IGMAsystem/SHELL'
cd Graphics_Systems/OpenGL/     && C:/MinGW/bin/mingw32-make Run MODE=Run
mingw32-make[2]: Entering directory `C:/Users/Andrew/Desktop/New Folder/trunk/EN
IGMAsystem/SHELL/Graphics_Systems/OpenGL'
mkdir .eobjs_Run
A subdirectory or file .eobjs_Run already exists.
mingw32-make[2]: [.eobjs_Run/GSscreen.o] Error 1 (ignored)
g++ -c GSscreen.cpp             -o .eobjs_Run/GSscreen.o
GSscreen.cpp:39:52: ../../Universal_System/instance_system.h: No such file or di
rectory
GSscreen.cpp: In function `int screen_redraw()':
GSscreen.cpp:60: error: `inst_iter' is not a member of `enigma'
GSscreen.cpp:60: error: `instance_list_first' is not a member of `enigma'
GSscreen.cpp:60: error: `instance_event_iterator' is not a member of `enigma'
GSscreen.cpp:60: error: `instance_list' is not a member of `enigma'
GSscreen.cpp:60: error: `instance_event_iterator' is not a member of `enigma'
GSscreen.cpp:62: error: `instance_event_iterator' is not a member of `enigma'
GSscreen.cpp:78: error: `instance_iterator' is not a member of `enigma'
GSscreen.cpp:78: error: `instance_list' is not a member of `enigma'
GSscreen.cpp:78: error: `instance_iterator' is not a member of `enigma'
GSscreen.cpp:78: error: `instance_list' is not a member of `enigma'
GSscreen.cpp:78: error: `instance_iterator' is not a member of `enigma'
GSscreen.cpp:80: error: `instance_iterator' is not a member of `enigma'
GSscreen.cpp:80: error: `instance_iterator' is not a member of `enigma'
GSscreen.cpp:83: error: `instance_iterator' is not a member of `enigma'
GSscreen.cpp:115: error: `instance_event_iterator' is not a member of `enigma'
GSscreen.cpp:115: error: `instance_list' is not a member of `enigma'
GSscreen.cpp:115: error: `instance_event_iterator' is not a member of `enigma'
GSscreen.cpp:115: error: `instance_list' is not a member of `enigma'
GSscreen.cpp:115: error: `instance_event_iterator' is not a member of `enigma'
GSscreen.cpp:117: error: `instance_event_iterator' is not a member of `enigma'
mingw32-make[2]: *** [.eobjs_Run/GSscreen.o] Error 1
mingw32-make[2]: Leaving directory `C:/Users/Andrew/Desktop/New Folder/trunk/ENI
GMAsystem/SHELL/Graphics_Systems/OpenGL'
mingw32-make[1]: *** [all] Error 2
mingw32-make[1]: Leaving directory `C:/Users/Andrew/Desktop/New Folder/trunk/ENI
GMAsystem/SHELL'
mingw32-make: *** [Game] Error 2
----Make returned error 2----------------------------------
3

on windows 32 bit vista
Logged
if you drop a cat with buttered toast strapped to its back, which side lands down?
joshdreamland: our languages are based on the idea that it's going to end up FUBAR
/kick retep998
Pages: [1]
  Print